検索条件
全1件
(1/1ページ)
# setenv CPPFLAGS '-I/usr/local/include -I/usr/include' # setenv LDFLAGS '-L/usr/local/lib -L/usr/lib' # cd dovecot-2.4.2 # ./configure --sysconfdir=/usr/local/etc/ --localstatedir=/var --with-ldap=yes --with-ssldir=/usr --program-transform-name=gsed --with-libbsd --without-bsdauth --without-pamとして、
# gmakeを実行・・・ 数分後、
CCLD test-lib gmake[4]: ディレクトリ '/usr/local/src/dovecot-2.4.2/src/lib' から出ます gmake[3]: ディレクトリ '/usr/local/src/dovecot-2.4.2/src/lib' から出ます Making all in lib-regex gmake[3]: ディレクトリ '/usr/local/src/dovecot-2.4.2/src/lib-regex' に入ります CC test-regex.o CC regex.lo CCLD libdregex.la gmake[3]: *** 'test-regex' に必要なターゲット '-L/usr/local/lib' を make するルールがありません. 中止. gmake[3]: ディレクトリ '/usr/local/src/dovecot-2.4.2/src/lib-regex' から出ます gmake[2]: *** [Makefile:600: all-recursive] エラー 1 gmake[2]: ディレクトリ '/usr/local/src/dovecot-2.4.2/src' から出ます gmake[1]: *** [Makefile:733: all-recursive] エラー 1 gmake[1]: ディレクトリ '/usr/local/src/dovecot-2.4.2' から出ます gmake: *** [Makefile:575: all] エラー 2となるんです。